Login
User Name:

Password:



Register
Forgot your password?
Vote for Us!
auth_update crash
Dec 23, 2017, 10:15 pm
By Remcon
check_tumble
Dec 18, 2017, 7:21 pm
By Remcon
parse description bug
Dec 15, 2017, 10:08 pm
By Remcon
Couple bugs
Dec 12, 2017, 5:42 pm
By Remcon
Bug in disarm( )
Nov 12, 2017, 6:54 pm
By GatewaySysop
LoP 1.46
Author: Remcon
Submitted by: Remcon
LOP 1.45
Author: Remcon
Submitted by: Remcon
LOP Heroes Edition
Author: Vladaar
Submitted by: Vladaar
Heroes sound extras
Author: Vladaar
Submitted by: Vladaar
6Dragons 4.3
Author: Vladaar
Submitted by: Vladaar
Users Online
CommonCrawl, Yandex, DotBot

Members: 0
Guests: 10
Stats
Files
Topics
Posts
Members
Newest Member
478
3,708
19,242
612
Jacki72H
Today's Birthdays
There are no member birthdays today.
Related Links
» SmaugMuds.org » General » Smaug Snippets » Rent Code v2.0 Multi
Forum Rules | Mark all | Recent Posts

Rent Code v2.0 Multi
< Newer Topic :: Older Topic > Problems Compiling

Pages:<< prev 1 next >>
Post is unread #1 Dec 18, 2004, 7:56 am
Go to the top of the page
Go to the bottom of the page

sokol

GroupMembers
Posts3
JoinedDec 18, 2004

I installed the Rent code Multi on smaugFUSS and compiled fine with the exception as follows.


rent.c: In function `do_quit':
rent.c:124: warning: implicit declaration of function `rent_calculate'
rent.c: At top level:
rent.c:219: warning: type mismatch with previous implicit declaration
rent.c:124: warning: previous implicit declaration of `rent_calculate'
rent.c:219: warning: `rent_calculate' was previously implicitly declared to retu
rn `int'
rent.c: In function `rent_adjust_pfile':
rent.c:533: error: too many arguments to function `load_char_obj'
make[1]: *** [o/rent.o] Error 1
make: *** [all] Error 2


I'm compiling in winxp with cygwin. I have pfiles installed and it compiled fine with that snippet.

-Sokol
       
Post is unread #2 Dec 18, 2004, 10:41 am
Go to the top of the page
Go to the bottom of the page

Samson
Black Hand
GroupAdministrators
Posts3,639
JoinedJan 1, 2002

You should be able to use it now. It's been awhile since some of these have been tested on more recent FUSS packages, but rent will now compile cleanly again.
       
Post is unread #3 Dec 19, 2004, 9:37 am
Go to the top of the page
Go to the bottom of the page

sokol

GroupMembers
Posts3
JoinedDec 18, 2004

Thanks a bunch

-sokol
       
Post is unread #4 Dec 21, 2004, 3:59 pm
Go to the top of the page
Go to the bottom of the page

sokol

GroupMembers
Posts3
JoinedDec 18, 2004

Ok, Downloaded the new version, Used araxis File merge to compare text files and make the changes you listed from the previous version. I copied the new rent.c and rent.h into the src dir, made clean and came up with this.


reset.c: In function `reset_area':
reset.c:1471: warning: implicit declaration of function `SET_OBJ_STAT'
reset.c:1474: error: structure has no member named `create_object'
make[1]: *** [o/reset.o] Error 1
make: *** [all] Error 2


Again cygwin on winxp.
any help is appreciated

-Sokol
       
Post is unread #5 Jan 2, 2005, 12:50 pm
Go to the top of the page
Go to the bottom of the page

Samson
Black Hand
GroupAdministrators
Posts3,639
JoinedJan 1, 2002

Another oops in a long series of oppses lately. That's now been fixed.
       
Pages:<< prev 1 next >>