Login
User Name:

Password:



Register
Forgot your password?
Vote for Us!
auth_update crash
Dec 23, 2017, 10:15 pm
By Remcon
check_tumble
Dec 18, 2017, 7:21 pm
By Remcon
parse description bug
Dec 15, 2017, 10:08 pm
By Remcon
Couple bugs
Dec 12, 2017, 5:42 pm
By Remcon
Bug in disarm( )
Nov 12, 2017, 6:54 pm
By GatewaySysop
LoP 1.46
Author: Remcon
Submitted by: Remcon
LOP 1.45
Author: Remcon
Submitted by: Remcon
LOP Heroes Edition
Author: Vladaar
Submitted by: Vladaar
Heroes sound extras
Author: Vladaar
Submitted by: Vladaar
6Dragons 4.3
Author: Vladaar
Submitted by: Vladaar
Users Online
CommonCrawl, Yandex, Yahoo!

Members: 0
Guests: 8
Stats
Files
Topics
Posts
Members
Newest Member
478
3,708
19,242
612
Jacki72H
Today's Birthdays
There are no member birthdays today.
Related Links
» SmaugMuds.org » Codebases » AFKMud Support & Development » Canno't compile after the mod...
Forum Rules | Mark all | Recent Posts

Canno't compile after the modify of Bugfix
< Newer Topic :: Older Topic > Canno't compile after the modify of

Pages:<< prev 1 next >>
Post is unread #1 Oct 4, 2005, 10:55 am   Last edited Oct 4, 2005, 10:56 am by LordSata
Go to the top of the page
Go to the bottom of the page

LordSata

GroupMembers
Posts2
JoinedSep 7, 2005

Hi all, i have a problem after the modify that the topic Bugfix says (1.76a).
The compile return me this error:

darkstar:~/Desktop/afkmud/src# make
make -s afkmud
Compiling o/build.o....
build.c: In function `bool check_for_area_conflicts(AREA_DATA*, int, int)':
build.c:6393: error: `first_build' undeclared (first use this function)
build.c:6393: error: (Each undeclared identifier is reported only once for each
function it appears in.)
make[1]: *** [o/build.o] Error 1
make: *** [all] Error 2

I undestand what kynd of error is but in all of the file i haven't seen the first_buil variables..
Anyone have ideas?

PS: i'm sorry for my English, but i'm an italian boy!
       
Post is unread #2 Oct 4, 2005, 4:44 pm
Go to the top of the page
Go to the bottom of the page

Samson
Black Hand
GroupAdministrators
Posts3,639
JoinedJan 1, 2002

Ah, that was an oops on my part. first_build doesn't exist. The fix post has been corrected.
       
Pages:<< prev 1 next >>