Login
User Name:

Password:



Register
Forgot your password?
Vote for Us!
auth_update crash
Dec 23, 2017, 10:15 pm
By Remcon
check_tumble
Dec 18, 2017, 7:21 pm
By Remcon
parse description bug
Dec 15, 2017, 10:08 pm
By Remcon
Couple bugs
Dec 12, 2017, 5:42 pm
By Remcon
Bug in disarm( )
Nov 12, 2017, 6:54 pm
By GatewaySysop
LoP 1.46
Author: Remcon
Submitted by: Remcon
LOP 1.45
Author: Remcon
Submitted by: Remcon
LOP Heroes Edition
Author: Vladaar
Submitted by: Vladaar
Heroes sound extras
Author: Vladaar
Submitted by: Vladaar
6Dragons 4.3
Author: Vladaar
Submitted by: Vladaar
Users Online
CommonCrawl, Yandex

Members: 0
Guests: 14
Stats
Files
Topics
Posts
Members
Newest Member
478
3,708
19,242
612
Jacki72H
Today's Birthdays
Evoru (32)
Related Links
» SmaugMuds.org » Codebases » AFKMud Support & Development » Compiling Problems
Forum Rules | Mark all | Recent Posts

Compiling Problems
< Newer Topic :: Older Topic >

Pages:<< prev 1 next >>
Post is unread #1 Sep 19, 2005, 10:35 am
Go to the top of the page
Go to the bottom of the page

Dewclaw

GroupMembers
Posts4
JoinedSep 19, 2005

When I tried to do a make clean it gave me these:

Makefile:167: .depend: No such file or directory
make: *** [.depend] Error 127
[machtig@kinky src]$ make clean
rm -f o/*.o afkmud afkmud.def afkmud.exp core resolver resolver.o
make all
make[1]: Entering directory `/home/machtig/mud/src'
make -s afkmud
make[2]: Entering directory `/home/machtig/mud/src'


and then this...

comm.c: In function `void init_mud(bool, int, int, int)':
comm.c:575: duplicate case value
comm.c:572: previously used here
comm.c:578: duplicate case value
comm.c:575: previously used here
make[2]: *** [o/comm.o] Error 1
make[2]: Leaving directory `/home/machtig/mud/src'
make[1]: *** [all] Error 2
make[1]: Leaving directory `/home/machtig/mud/src'
make: *** [clean] Error 2


How do I go about fixing this? Thanks
       
Post is unread #2 Sep 19, 2005, 10:54 am
Go to the top of the page
Go to the bottom of the page

Dewclaw

GroupMembers
Posts4
JoinedSep 19, 2005

Well, I tried Commenting out the NEED_DL marker (guessing from the Install.txt) file but now I get this...

o/comm.o(.text+0x69b2): In function `cleanup_memory()':
/home/machtig/mud/src/comm.c:4608: undefined reference to `dlclose'
o/db.o(.text+0x340a): In function `boot_db(bool)':
/home/machtig/mud/src/db.c:2262: undefined reference to `dlopen'
o/hotboot.o(.text+0x1625): In function `do_hotboot':
/home/machtig/mud/src/hotboot.c:816: undefined reference to `dlclose'
o/hotboot.o(.text+0x1671):/home/machtig/mud/src/hotboot.c:824: undefined reference to `dlopen'
o/mspecial.o(.text+0x208): In function `m_spec_lookup(char*)':
/home/machtig/mud/src/mspecial.c:131: undefined reference to `dlsym'
o/mspecial.o(.text+0x20f):/home/machtig/mud/src/mspecial.c:132: undefined reference to `dlerror'
o/tables.o(.text+0x10): In function `spell_function(char*)':
/home/machtig/mud/src/tables.c:75: undefined reference to `dlsym'
o/tables.o(.text+0x17):/home/machtig/mud/src/tables.c:76: undefined reference to `dlerror'
o/tables.o(.text+0x4e): In function `skill_function(char*)':
/home/machtig/mud/src/tables.c:89: undefined reference to `dlsym'
o/tables.o(.text+0x55):/home/machtig/mud/src/tables.c:90: undefined reference to `dlerror'
collect2: ld returned 1 exit status
       
Post is unread #3 Sep 19, 2005, 5:40 pm
Go to the top of the page
Go to the bottom of the page

Samson
Black Hand
GroupAdministrators
Posts3,639
JoinedJan 1, 2002

Your problem seems to be that you defined two of the port values as the same number. It has nothing to do with NEED_DL whatsoever. Unless you know you need the multiport support, I would go ahead and turn that off.
       
Pages:<< prev 1 next >>