Login
User Name:

Password:



Register
Forgot your password?
Vote for Us!
parse description bug
Dec 15, 2017, 10:08 pm
By Remcon
Couple bugs
Dec 12, 2017, 5:42 pm
By Remcon
Bug in disarm( )
Nov 12, 2017, 6:54 pm
By GatewaySysop
Bug in will_fall( )
Oct 23, 2017, 1:35 am
By GatewaySysop
Bug in do_zap( ), do_brandish( )
Oct 18, 2017, 1:52 pm
By GatewaySysop
LOP 1.45
Author: Remcon
Submitted by: Remcon
LOP Heroes Edition
Author: Vladaar
Submitted by: Vladaar
Heroes sound extras
Author: Vladaar
Submitted by: Vladaar
6Dragons 4.3
Author: Vladaar
Submitted by: Vladaar
Memwatch
Author: Johan Lindh
Submitted by: Vladaar
Users Online
CommonCrawl

Members: 0
Guests: 10
Stats
Files
Topics
Posts
Members
Newest Member
477
3,706
19,240
608
LAntorcha
Today's Birthdays
There are no member birthdays today.
Related Links
» SmaugMuds.org » Codebases » AFKMud Support & Development » AFK compile error
Forum Rules | Mark all | Recent Posts

AFK compile error
< Newer Topic :: Older Topic >

Pages:<< prev 1 next >>
Post is unread #1 May 7, 2015, 3:43 am
Go to the top of the page
Go to the bottom of the page

ardentcrest
Fledgling
GroupMembers
Posts16
JoinedNov 27, 2014

Trying to compile latest AFK. getting this error
$ make
Building AFKMud....
make -j2 -s afkmud
Compiling o/imc.o....
Compiling o/act_info.o....
imc.cpp: In function ‘void imc_loop()’:
imc.cpp:2568:78: error: ‘select’ was not declared in this scope
if( select( this_imcmud->desc + 1, &in_set, &out_set, nullptr, &null_time ) < 0 )
^
Makefile:172: recipe for target 'o/imc.o' failed
make[1]: *** [o/imc.o] Error 1
make[1]: *** Waiting for unfinished jobs....
Makefile:109: recipe for target 'all' failed
make: *** [all] Error 2


any help. Smaugfuss compiles ok
       
Pages:<< prev 1 next >>